Nr,gender,Ålder,ICU tid,uppdelning PFI,time on MV,ECMO,Indeln ROG,pulmonary emboli,pneumonmedistinum/pneuothorax,HOSPITAL STAY TOTAL DAYS,längd x,vikt visit 1,CRP highest,IL-6 highest
1,0,30,56,0,56,1,1.0,0,0,66,158.0,67.5,278,
2,1,69,15,1,15,0,1.0,1,0,53,192.0,77.3,264,78.0
3,1,18,8,0,7,0,0.0,0,0,15,176.0,91.0,320,11.0
4,1,55,19,1,18,0,0.0,0,0,49,171.0,57.0,422,122.0
5,1,51,7,0,0,0,1.0,0,0,28,175.0,87.0,226,71.0
6,1,69,42,1,42,0,1.0,1,1,91,169.0,82.0,407,959.0
7,1,66,11,1,10,0,1.0,0,0,31,162.0,75.0,329,1109.0
8,1,61,15,0,11,0,1.0,0,0,39,173.0,73.0,311,
9,1,69,5,0,3,0,0.0,0,0,16,182.0,95.0,164,38.0
10,1,56,6,0,5,0,0.0,0,0,9,174.0,94.0,240,36.0
11,0,64,49,0,39,0,1.0,1,1,67,163.0,61.0,344,
12,0,27,17,0,15,0,1.0,0,0,24,163.0,73.0,304,3238.0
13,1,46,2,1,0,0,0.0,0,0,10,177.0,95.0,65,19.0
14,1,64,45,0,43,0,1.0,0,0,72,162.0,78.5,568,424.0
15,1,68,5,1,3,0,1.0,0,0,11,169.0,71.0,151,165.0
16,0,59,11,1,8,0,0.0,0,0,19,169.0,71.0,313,50.0
17,1,72,12,1,11,0,1.0,0,0,26,191.0,94.0,276,406.0
18,1,42,18,0,16,0,1.0,0,0,24,165.0,82.0,438,761.0
19,0,64,16,1,13,0,,0,0,22,162.0,71.0,189,38.0
20,1,51,28,1,22,0,1.0,0,0,55,166.0,79.0,444,313.0
21,0,63,25,0,23,0,1.0,0,0,49,157.0,86.5,395,88.0
22,1,61,20,0,11,0,1.0,0,1,46,177.0,90.0,149,140.0
23,1,52,31,0,31,0,,1,1,38,181.0,76.0,213,
24,1,42,17,0,16,0,1.0,0,0,35,172.0,88.0,476,212.0
25,1,42,55,0,53,1,1.0,0,0,51,160.0,57.0,469,1020.0
26,1,49,29,0,29,0,1.0,0,0,50,174.0,80.0,642,383.0
27,1,53,29,0,29,0,1.0,1,0,37,180.0,77.0,449,112.0
28,1,44,16,0,14,0,0.0,1,0,27,163.0,75.0,447,487.0
29,1,51,10,1,10,0,0.0,0,0,12,171.0,80.0,347,96.0
30,1,57,12,0,10,0,0.0,0,0,21,177.0,77.0,402,884.0
31,0,75,12,0,12,0,1.0,0,0,22,161.0,66.0,339,
32,0,50,4,1,4,0,0.0,0,0,11,166.0,99.0,364,120.0
33,1,59,16,1,13,0,1.0,0,0,20,172.0,94.0,519,379.0
34,1,59,7,0,6,0,1.0,0,0,34,168.0,86.5,306,375.0
35,1,66,14,1,14,0,1.0,0,0,27,170.0,72.5,284,273.0
36,0,61,2,1,0,0,1.0,0,0,14,166.0,95.0,208,126.0
37,0,36,12,1,11,0,0.0,0,0,21,159.0,64.0,116,24.0
38,1,58,34,0,34,0,1.0,0,0,65,167.0,90.0,135,
39,0,53,4,1,0,0,0.0,0,0,16,174.0,90.0,255,105.0
40,1,65,16,0,16,0,1.0,0,0,41,183.0,88.5,332,520.0
41,1,63,5,0,0,0,0.0,1,0,28,185.0,142.0,312,476.0
42,1,70,17,0,16,0,1.0,0,1,28,172.0,77.0,402,
43,1,73,16,0,11,0,1.0,0,0,22,164.0,67.0,350,
44,1,55,24,0,18,0,1.0,0,0,62,177.0,97.5,417,
45,1,40,26,1,25,0,0.0,0,0,35,178.0,149.0,267,
46,1,55,46,0,45,1,1.0,1,0,88,185.0,81.0,548,
47,0,65,31,0,25,0,1.0,0,0,44,169.0,71.0,245,
48,1,64,54,0,52,0,1.0,1,0,72,176.0,90.0,362,
49,1,61,23,0,20,0,1.0,0,0,67,175.0,85.0,457,663.0
50,1,66,35,0,34,0,1.0,1,0,35,176.0,76.0,502,21881.0
51,1,40,44,1,44,0,0.0,1,0,61,172.0,95.0,554,696.0
52,0,57,14,1,12,0,1.0,0,0,22,172.0,98.0,215,148.0
53,1,46,21,1,18,0,1.0,1,0,42,186.0,88.0,459,408.0
54,1,56,19,1,18,0,1.0,1,0,37,172.0,69.0,492,4693.0
55,1,50,15,0,14,0,1.0,0,0,26,187.0,130.0,396,274.0
56,0,49,16,0,15,1,1.0,0,0,35,160.0,65.5,103,3.5
57,1,49,16,1,15,0,1.0,0,0,31,183.0,78.5,426,77.0
58,1,67,13,0,12,0,1.0,0,0,32,174.0,82.0,378,344.0
59,1,58,54,0,43,0,1.0,0,0,89,173.0,81.0,335,900.0
60,0,62,30,0,25,0,0.0,1,0,52,168.0,113.5,320,237.0
61,1,56,25,0,24,0,1.0,0,0,45,185.0,57.0,325,
62,1,72,51,0,49,0,1.0,0,0,58,165.0,76.0,358,
63,1,57,26,0,23,0,1.0,0,0,43,184.0,99.0,338,1133.0
64,1,52,52,0,52,0,1.0,0,0,71,165.0,113.5,407,822.0
65,1,69,26,0,15,0,1.0,0,0,49,182.0,95.0,348,478.0
66,1,63,17,0,10,0,0.0,0,0,60,167.0,78.0,101,393.0
67,1,51,47,0,45,0,1.0,0,0,78,176.0,113.5,122,424.0
68,1,59,52,0,51,0,1.0,1,0,72,174.0,86.0,485,682.0
69,1,72,8,0,0,0,0.0,0,0,8,169.0,85.0,321,13.0
70,1,45,66,0,69,1,1.0,1,0,76,174.0,85.0,273,1356.0
71,1,74,23,0,21,0,1.0,0,0,48,187.0,88.0,402,
72,1,71,16,0,9,0,1.0,0,0,42,179.0,83.0,209,97.0
73,0,25,34,0,29,0,0.0,0,0,51,166.0,83.0,517,124.0
74,1,61,10,0,7,0,0.0,1,0,19,172.0,90.0,330,120.0
75,0,73,11,0,10,0,1.0,0,0,18,162.0,55.0,264,390.0
76,1,73,9,0,8,0,1.0,0,0,20,184.0,,365,377.0
77,1,64,7,1,4,0,1.0,0,0,16,192.0,,234,194.0
78,1,54,14,1,9,0,1.0,0,0,35,176.0,83.0,343,199.0
79,1,59,10,0,8,0,0.0,0,0,34,178.0,79.0,241,66.0
80,1,51,45,0,40,0,1.0,0,0,68,177.0,79.0,350,259.0
81,0,37,12,0,10,0,0.0,0,0,24,173.0,95.0,334,167.0
82,1,61,42,0,36,0,1.0,0,0,81,182.0,77.0,495,568.0
83,1,56,9,0,3,0,1.0,1,0,42,182.0,94.5,348,558.0
84,0,52,45,0,42,1,1.0,1,0,53,155.0,59.0,487,524.0
85,1,52,10,1,9,0,0.0,0,0,17,189.0,73.0,186,36.0
86,1,28,5,1,4,0,0.0,0,0,8,183.0,95.0,230,119.0
87,1,58,23,0,22,0,1.0,1,0,46,171.0,76.0,422,730.0
88,1,56,22,0,20,0,1.0,0,0,38,177.0,67.5,391,355.0
89,1,47,10,0,8,0,0.0,0,0,14,166.0,95.0,315,209.0
90,1,60,21,0,20,0,0.0,0,0,38,180.0,71.0,551,840.0
91,1,54,11,0,9,0,0.0,0,0,20,180.0,85.0,404,150.0
92,1,67,51,0,49,0,1.0,1,1,100,180.0,78.0,251,1160.0
93,1,58,5,0,0,0,1.0,1,0,16,177.0,67.5,163,49.0
94,1,61,4,0,1,0,0.0,0,0,15,173.0,80.0,160,99.0
95,0,45,13,0,12,0,0.0,0,0,21,166.0,78.0,339,171.0
96,1,42,10,0,9,0,1.0,1,0,21,166.0,77.0,329,65.0
97,1,60,15,1,13,0,1.0,0,0,35,186.0,97.0,558,738.0
98,1,44,20,0,19,0,0.0,0,0,38,161.0,77.0,348,381.0
99,1,62,8,1,0,0,1.0,0,0,21,166.0,72.5,266,40.0
100,1,55,13,1,10,0,0.0,0,0,31,182.0,73.0,179,
101,1,50,1,1,0,0,0.0,0,0,12,176.0,95.0,78,45.0
102,1,55,12,1,12,0,1.0,0,0,34,163.0,92.0,410,38.0
103,1,56,25,0,21,0,0.0,0,0,54,178.0,73.0,261,125.0
104,1,40,15,0,12,0,0.0,0,0,22,183.0,95.0,130,
105,1,39,15,0,9,0,1.0,0,0,34,180.0,86.5,221,
106,1,62,13,1,11,0,1.0,0,0,23,171.0,96.0,508,138.0
107,0,64,14,0,12,0,1.0,0,1,31,158.0,75.0,431,7.4
108,1,62,14,0,12,0,0.0,0,0,23,184.0,73.1,170,
109,1,78,34,0,32,0,1.0,0,1,81,,,233,
110,1,59,2,1,2,0,1.0,0,1,32,174.0,85.5,345,
111,0,61,29,0,26,0,1.0,0,1,68,,,350,119.0
112,0,74,47,0,47,0,1.0,1,0,HOSPITAL STAY TOTAL DAYS,,,221,313.0
113,1,67,4,0,0,0,1.0,0,0,13,,,173,
114,0,70,19,0,17,0,,0,0,92,,,176,
115,1,65,3,1,6,0,1.0,0,0,34,,,331,
116,0,52,19,0,13,0,1.0,0,0,43,,,349,
117,1,43,8,0,3,0,,0,0,0,,,172,61.0
118,0,51,11,0,10,0,0.0,0,0,26,,,309,
119,1,65,18,0,14,0,1.0,0,0,20,,,177,
120,0,45,44,0,41,1,1.0,1,0,0,,,154,
121,1,67,43,0,42,0,1.0,0,1,73,,,270,
122,1,52,3,0,0,0,0.0,0,0,26,,,112,
